Home > Gcc Error > Gcc Error Writing To Broken Pipe

Gcc Error Writing To Broken Pipe

not post a blank message. Please type your message and try again. joelsaxton Level 1 (0 points) Q: fatal error: error writing to -: Broken pipe Why does this simple default program for Xcode fail in this way? I didn't code this, this is the default for a new C++ project in Xcode (3.2)#include int main (int argc, char * const argv[]) { // insert code here... std::cout << "Hello, World!\n"; return 0;}What is really weird is that it worked the first time, and I have changed nothing. All proper files appear to be in the /Developer/usr/bin folder and it doesn't seem to have problems finding anything. Xcode 3.2, Mac OS X (10.6.8) Posted on Jul 14, 2012 4:23 PM I have this question too Close Q: fatal error: error writing to -: Broken pipe All replies Helpful answers by joelsaxton, joelsaxton Jul 14, 2012 4:29 PM in response to joelsaxton Level 1 (0 points) Jul 14, 2012 4:29 PM in response to joelsaxton This is the salient portion of the log:/Developer/usr/bin/../libexec/gcc/i686-apple-darwin10/4.2.1/as: assembler (/Developer/usr/bin/../libexec/gcc/darwin/i386/as or /Developer/usr/bin/../local/libexec/gcc/darwin/i386/as) for architecture i386 not installed/Developer/usr/bin/../libexec/gcc/i686-apple-darwin10/4.2.1/as: no assemblers installedwriting to -: Broken pipecompilation terminated.For whatever reason, I see a shortcut to both "as" and "ld". It seems the Xcode installer has a bug in it. Helpful (0) Reply options Link to this post by joelsaxton, joelsaxton Jul 14, 2012 5:08 PM in response to joelsaxton Level 1 (0 points) Jul 14, 2012 5:08 PM in response to joelsaxton I uninstalled and will try reinstalling this piece of crap. I swear I am going to throw this computer out the window in a second. Helpful (0) Reply options Link to this post This site contains user submitted content, comments and opinions and is for informational pur

architecture ppc not installed Installed assemblers are: /usr/bin/../libexec/as/x86_64/as for architecture x86_64 /usr/bin/../libexec/as/i386/as for architecture i386 /usr/bin/../libexec/as/arm/as for architecture arm _imaging.c:3017: warning: initialization from incompatible pointer type _imaging.c:3077: warning: initialization from incompatible pointer type _imaging.c:3281: fatal error: error writing to -: Broken pipe compilation terminated. _imaging.c:3017: warning: initialization from incompatible pointer type _imaging.c:3077: warning: initialization from incompatible pointer type lipo: can't open input file: https://discussions.apple.com/thread/4107216?tstart=0 /var/tmp//ccsCS1Iv.out (No such file or directory) error: command 'gcc-4.2' failed with exit status 1 The reason for this error is that Apple has removed from Xcode the assembler for PPC, while the core system retains their PPC images in the fat binaries. http://glue.readthedocs.io/en/latest/faq.html If you run file /usr/bin/python you will likely find the following: /usr/bin/python: Mach-O universal binary with 3 architectures /usr/bin/python (for architecture x86_64): Mach-O 64-bit executable x86_64 /usr/bin/python (for architecture i386): Mach-O executable i386 /usr/bin/python (for architecture ppc7400): Mach-O executable ppc Python compiles C extensions with the same compiler flags that Python itself was compiled with. The solution? Install glue using this line: $ sudo env ARCHFLAGS='-arch i386 -arch x86_64' pip install glue Table Of Contents FAQ Errors compiling PIL in Snow Leopard Previous topic Settings Next topic Changelog This Page Show Source Quick search Enter search terms or a module, class or function name. Navigation index next | previous | glue 0.11.1 documentation » © Copyright 2013, Jorge Bastida. Created using Sphinx 1.3.5.

here for a quick overview of the site Help Center Detailed answers to http://superuser.com/questions/259278/python-2-6-1-pycrypto-2-3-pypi-package-broken-pipe-during-build any questions you might have Meta Discuss the workings and https://bugzilla.mozilla.org/show_bug.cgi?id=643936 policies of this site About Us Learn more about Stack Overflow the company Business Learn more about hiring developers or posting ads with us Super User Questions Tags Users Badges Unanswered Ask Question _ Super User is a question and answer gcc error site for computer enthusiasts and power users. Join them; it only takes a minute: Sign up Here's how it works: Anybody can ask a question Anybody can answer The best answers are voted up and rise to the top Python 2.6.1, pycrypto 2.3 pypi package: “Broken Pipe” during build up vote 11 gcc error writing down vote favorite 5 I am attempting to install Fabric, which requires pycrypto. During the build for pycrypto I always receive a "Broken Pipe" error. I don't know where to start to fix the problem. I'm running Mac OS X Snow Leopard 10.6.6, all updates installed; Python 2.6.1; GCC 4.2; XCode 4 (in case that updated GCC) The exact error is: $ sudo python setup.py build Password: running build running build_py running build_ext warning: GMP library not found; Not building Crypto.PublicKey._fastmath. building 'Crypto.Hash.MD2' extension gcc-4.2 -fno-strict-aliasing -fno-common -dynamic -fwrapv -Wall -Wstrict-prototypes -DENABLE_DTRACE -arch i386 -arch ppc -arch x86_64 -pipe -std=c99 -O3 -fomit-frame-pointer -Isrc/ -I/System/Library/Frameworks/Python.framework/Versions/2.6/include/python2.6 -c src/MD2.c -o build/temp.macosx-10.6-universal-2.6/src/MD2.o /usr/libexec/gcc/powerpc-apple-darwin10/4.2.1/as: assembler (/usr/bin/../libexec/gcc/darwin/ppc/as or /usr/bin/../local/libexec/gcc/darwin/ppc/as) for architecture ppc not installed Installed assemblers are: /usr/bin/../libexec/gcc/darwin/x86_64/as for architecture x86_64 /usr/bin/../libexec/gcc/darwin/i386/as for architecture i386 src/MD2.c:134: fatal error: error writing to -: Broken pipe compilation terminated. lipo: can't open input file: /var/tmp//ccfADoXD.out (No such file or directory) error: command 'gcc-4.2

BMO. For more details see Persona Deprecated. Last Comment Bug643936 - "error writing to -: Broken pipe" on bm-xserve12 Summary: "error writing to -: Broken pipe" on bm-xserve12 Status: RESOLVED WORKSFORME Whiteboard: [slaveduty] Keywords: Product: Release Engineering Classification: Other Component: Other (show other bugs) Version: other Platform: x86 Mac OS X Importance: -- normal (vote) TargetMilestone: --- Assigned To: Nobody; OK to take it and work on it QA Contact: TriageOwner: Mentors: URL: Depends on: Blocks: Show dependency tree /graph Reported: 2011-03-22 15:11 PDT by Phil Ringnalda (:philor) Modified: 2013-08-12 21:54 PDT (History) CC List: 1 user (show) dustin See Also: Crash Signature: (edit) QA Whiteboard: Iteration: --- Points: --- Tracking Flags: Attachments Add an attachment (proposed patch, testcase, etc.) Description Phil Ringnalda (:philor) 2011-03-22 15:11:38 PDT http://tinderbox.mozilla.org/showlog.cgi?log=TraceMonkey/1300829298.1300830206.22340.gz OS X 10.5.2 tracemonkey leak test build on 2011/03/22 14:28:18 s: bm-xserve12 /usr/libexec/gcc/i686-apple-darwin9/4.2.1/as: fatal error in /usr/bin/../libexec/gcc/darwin/i386/as /builds/slave/tm-osx-dbg/build/content/base/src/nsContentList.cpp:963: fatal error: error writing to -: Broken pipe compilation terminated. make[6]: *** [nsContentList.o] Error 1 Comment 1 Dustin J. Mitchell [:dustin] 2011-03-22 15:32:43 PDT Looks like a compile error and/or a bug in gcc/binutils to me.. I don't see any other such failures for that slave, so let's give it some time to finish another build or two. If there are more failures, we'll pull it. Comment 2 Dustin J. Mitchell [:dustin] 2011-03-23 15:59:57 PDT It's successfully run three more builds since then, one of exactly the same flavor as the failure. So I'll call this a one-off bug.. Note You need to log in before you can comment on or make changes to this bug. Format For Printing -XML -JSON - Clone This Bug -Top of page Home | New | Browse | Search | [help] | Reports | Product Dashboard Privacy Notice | Legal Terms

 

gcc error

Gcc Error p your program GCC reports errors with the source file gcc warnings name and line number where the problem is gcc pragma warning apparent Warnings report other unusual conditions in your code that may indicate a gcc error message format problem although compilation can and does proceed Warning messages also report the source file name and line number but include the text gcc errors list lsquo warning rsquo to distinguish them from error messages Warnings may indicate danger points where you should check to make sure that your program really does what you intend or the use of

gcc error at this point in file

Gcc Error At This Point In File p standards or relaxed in standards-conforming ways to facilitate compilation or runtime performance Some of these changes are not visible to the naked eye and will not cause problems when updating gcc option from older versions However some of these changes are visible and can cause grief p Fpermissive p to users porting to GCC This document is an effort to identify major issues and provide clear solutions in a quick p Unrecognized Command Line Option p and easily searched manner Additions and suggestions for improvement are welcome General issues Use of invalid

gcc error aliased to undefined symbol

Gcc Error Aliased To Undefined Symbol p here for a quick overview of the site Help Center Detailed answers to any questions you might have Meta Discuss the workings and policies of this site About Us Learn more about Stack Overflow the company Business Learn more about hiring developers or posting ads with us Stack Overflow Questions Jobs Documentation Tags Users Badges Ask Question x Dismiss Join the Stack Overflow Community Stack Overflow is a community of million programmers just like you helping each other Join them it only takes a minute Sign up Aliasing a function on a C

gcc error previously used here

Gcc Error Previously Used Here p here for a quick overview of the site Help Center Detailed answers to any questions you might have Meta Discuss the workings and policies of this site About Us Learn more about Stack Overflow the company Business Learn more about hiring developers or posting ads with us Stack Overflow Questions Jobs Documentation Tags Users Badges Ask Question x Dismiss Join the Stack Overflow Community Stack Overflow is a community of million programmers just like you helping each other Join them it only takes a minute Sign up Compiling TCL using gcc up vote down

gcc error operation on may be undefined

Gcc Error Operation On May Be Undefined p here for a quick overview of the site Help Center Detailed answers to any questions you might have Meta Discuss the workings and policies of p Wsequence-point Gcc p this site About Us Learn more about Stack Overflow the company Business Learn werror sequence-point more about hiring developers or posting ads with us Stack Overflow Questions Jobs Documentation Tags Users Badges Ask Question p C Sequence Point p x Dismiss Join the Stack Overflow Community Stack Overflow is a community of million programmers just like you helping each other Join them it

gcc error parser

Gcc Error Parser p here for a quick overview of the site Help Center Detailed answers to any questions you might have Meta Discuss the workings and policies of this site About Us Learn more about gcc error message format Stack Overflow the company Business Learn more about hiring developers or posting ads with stlfilt us Stack Overflow Questions Jobs Documentation Tags Users Badges Ask Question x Dismiss Join the Stack Overflow Community Stack Overflow is gccfilter a community of million programmers just like you helping each other Join them it only takes a minute Sign up gcc c command

gcc compiler error list

Gcc Compiler Error List p here for a quick overview of the site Help Center Detailed answers to any questions you might have Meta Discuss the workings gcc error message format and policies of this site About Us Learn more about Stack gcc errors list Overflow the company Business Learn more about hiring developers or posting ads with us Stack Overflow Questions Jobs gcc error messages Documentation Tags Users Badges Ask Question x Dismiss Join the Stack Overflow Community Stack Overflow is a community of million programmers just like you helping each other Join them p Gcc error p it

gcc error ndiswrapper

Gcc Error Ndiswrapper p here for a quick overview of the site Help Center Detailed answers to any questions you might have Meta Discuss the workings and policies of this site About Us Learn more about Stack Overflow the company Business Learn more about hiring developers or posting ads with us Unix Linux Questions Tags Users Badges Unanswered Ask Question Unix Linux Stack Exchange is a question and answer site for users of Linux FreeBSD and other Un x-like operating systems Join them it only takes a minute Sign up Here's how it works Anybody can ask a question Anybody

gcc error message format

Gcc Error Message Format p to stderr the standard error file and have the following form e adb Incorrect spelling of keyword function e adb should be is The first integer after the file p Stlfilt p name is the line number in the file and the second integer gcc options is the column number within the line GPS can parse the error messages and point to the referenced character The following switches provide control over the error message format -gnatv The v stands for verbose The effect of this setting is to write long-format error messages to stdout the

gcc error was not declared in this scope

Gcc Error Was Not Declared In This Scope p Anyway I have this error and can not figure out what I'm doing wrong any help is appriciated wordfinder cpp In function 'bool parseSize std string int int ' wordfinder cpp error 'isInteger' was not declared in this scope wordfinder cpp br br br br br br br br br br br br br br br br br br br br br br br br br br br br br br br br br br br br br br br br br br br br br br br br br var

gcc error elf_i386 no such file or directory

Gcc Error Elf i No Such File Or Directory p here for a quick overview of the site Help Center Detailed answers to any questions you might have Meta Discuss the workings and policies of this site About Us Learn more about Stack what is elf i Overflow the company Business Learn more about hiring developers or posting ads with us p Ld File Not Found Elf i p Stack Overflow Questions Jobs Documentation Tags Users Badges Ask Question x Dismiss Join the Stack Overflow Community Stack Overflow is a p Gcc Error Unrecognized Command Line Option -m p community

gcc error forming pointer to reference type

Gcc Error Forming Pointer To Reference Type p here for a quick overview of the site Help Center Detailed answers to any questions you might have Meta Discuss the std vector of references workings and policies of this site About Us Learn more about Stack std reference wrapper Overflow the company Business Learn more about hiring developers or posting ads with us Stack Overflow Questions Jobs Documentation Tags Users Badges Ask Question x Dismiss Join the Stack Overflow Community Stack Overflow is a community of million programmers just like you helping each other Join them it only takes a minute

gcc error line number format

Gcc Error Line Number Format p and have the following form e adb Incorrect spelling of keyword function e adb should be is The first integer after the file name is the line number in the file and the second integer is the column number gcc error message format within the line glide can parse the error messages and point to the referenced character gcc options The following switches provide control over the error message format -gnatvThe v stands for verbose The effect of this setting is to write long-format error messages to stdout the standard output file The same

gcc error 193

Gcc Error p here for a quick overview of the site Help Center Detailed answers to any questions you might have Meta Discuss the workings and policies of this site About Us Learn more about Stack Overflow the company Business Learn more about hiring developers or posting ads with us Stack Overflow Questions Jobs Documentation Tags Users Badges Ask Question x Dismiss Join the Stack Overflow Community Stack Overflow is a community of million programmers just like you helping each other Join them it only takes a minute Sign up Cygwin GDB gives error when trying to start program up

gcc error branch out of range

Gcc Error Branch Out Of Range p to Milestone Linaro GCC Edit Fix Released Low Andrew Stubbs Edit Linaro GCC - You need to log in to change this bug's status Affecting Linaro GCC Filed here by Michael Hope When - - Confirmed - - Assigned - - Started work - - Completed - - Target Distribution Baltix BOSS Juju Charms Collection Elbuntu Guadalinex Guadalinex Edu Kiwi Linux nUbuntu PLD Linux Tilix tuXlab Ubuntu Ubuntu Linaro Evaluation Build Ubuntu RTM Package Find hellip Project Find hellip Status Importance Milestone Fix Released Low Linaro GCC - Assigned to Me Andrew Stubbs

gcc error 137

Gcc Error p Sign in Pricing Blog Support Search GitHub option form This repository Watch Star Fork ps dev ps toolchain Code Issues Pull requests Projects Wiki Pulse Graphs New issue compile error scripts -gcc- -PPU-stage sh Failed Closed borice opened this Issue Jan middot comments Projects None yet option form Labels None yet option form Milestone No milestone option form Assignees No one assigned participants borice commented Jan Getting an error while compiling the toolchain Using Ubuntu Maverick and have all the required packages installed bin sh line Killed build genautomata gcc config rs rs md insn-conditions md tmp-automata

gcc error could not split insn

Gcc Error Could Not Split Insn p -Clone This Bug -Last Comment First Last Prev Next This bug is not in your last search results Bug - avr-gcc error could not split insn Summary avr-gcc error could not split insn Status CLOSED ERRATA Aliases None Product Fedora Classification Fedora Component avr-gcc Show other bugs Sub Component --- Version Hardware x Linux Priority low Severity high TargetMilestone --- TargetRelease --- Assigned To Thibault North QA Contact Fedora Extras Quality Assurance Docs Contact URL Whiteboard Keywords Depends On Blocks Show dependency tree graph Reported - - EST by Jakob Hirsch Modified -

gcc error attributes are not allowed on a function-definition

Gcc Error Attributes Are Not Allowed On A Function-definition p here for a quick overview of the site Help Center Detailed answers to any questions you might have Meta Discuss the workings and policies of this site About Us Learn more about Stack Overflow the company Business Learn more about hiring developers or posting ads with us Stack Overflow Questions Jobs Documentation Tags Users Badges Ask Question x Dismiss Join the Stack Overflow Community Stack Overflow is a community of million programmers just like you helping each other Join them it only takes a minute Sign up gcc attributes with

gcc error bad register name

Gcc Error Bad Register Name p here for a quick overview of the site Help Center Detailed answers to any questions you might have Meta Discuss the workings and policies of this site About Us Learn more about Stack Overflow the company Business Learn more about hiring developers or posting ads with us Stack Overflow Questions Jobs Documentation Tags Users Badges Ask Question x Dismiss Join the Stack Overflow Community Stack Overflow is a community of million programmers just like you helping each other Join them it only takes a minute Sign up Inline-Assembly bad register name up vote down

gcc error comma at end of enumerator list

Gcc Error Comma At End Of Enumerator List p here for a quick overview of the site Help Center Detailed answers to any questions you might have Meta Discuss the workings and policies of this site About Us Learn more about Stack Overflow the company Business Learn more about hiring developers or posting ads with us Stack Overflow Questions Jobs Documentation Tags Users Badges Ask Question x Dismiss Join the Stack Overflow Community Stack Overflow is a community of million programmers just like you helping each other Join them it only takes a minute Sign up How to ignore gcc

gcc error messages color

Gcc Error Messages Color p e g its width You can use the options described below to control the formatting algorithm for diagnostic messages e g how many characters per line how often source fdiagnostics-color location information should be reported Note that some language front ends gcc color output may not honor these options -fmessage-length nTry to format error messages so that they fit on lines of gcc colors about n characters The default is characters for g and for the rest of the front ends supported by GCC If n is zero then p Colorgcc p no line-wrapping is

gcc error extra semicolon

Gcc Error Extra Semicolon p here for a quick overview of the site Help Center Detailed answers to any questions you might have Meta Discuss the workings and policies of this site About Us Learn more about Stack Overflow the company Business Learn more about hiring developers or posting ads with us Stack Overflow Questions Jobs Documentation Tags Users Badges Ask Question x Dismiss Join the Stack Overflow Community Stack Overflow is a community of million programmers just like you helping each other Join them it only takes a minute Sign up Suppressing ldquo extra ' ' rdquo error in

gcc error unrecognized option no-cpp-precomp

Gcc Error Unrecognized Option No-cpp-precomp p here for a quick overview of the site Help Center Detailed answers to any questions you might have Meta Discuss the workings and policies of this site About Us Learn more about Stack Overflow the company Business Learn more about hiring developers or posting ads with us Stack Overflow Questions Jobs Documentation Tags Users Badges Ask Question x Dismiss Join the Stack Overflow Community Stack Overflow is a community of million programmers just like you helping each other Join them it only takes a minute Sign up GCC error when installing ncurses on OS

gcc error calling fdopen bad file descriptor

Gcc Error Calling Fdopen Bad File Descriptor p here for a quick overview of the site Help Center Detailed answers to any questions you might have Meta Discuss the workings and policies of this site About Us Learn more about Stack Overflow the company Business Learn more about hiring developers or posting ads with us Stack Overflow Questions Jobs Documentation Tags Users Badges Ask Question x Dismiss Join the Stack Overflow Community Stack Overflow is a community of million programmers just like you helping each other Join them it only takes a minute Sign up Makefile 'fdopen Bad file descriptor'

gcc error messages format

Gcc Error Messages Format p to stderr the standard error file and have the following form e adb Incorrect spelling of keyword function e adb should be is The first integer after the file name is the line number in the file and the second integer is the column number within the line GPS can parse the error messages and point to the referenced character The following switches provide control over the error message format -gnatv The v stands for verbose The effect of this setting is to write long-format error messages to stdout the standard output file The same

gcc error redeclared as different kind of symbol

Gcc Error Redeclared As Different Kind Of Symbol p here for a quick overview of the site Help Center Detailed answers to any questions you might have Meta Discuss the workings and policies of this site About Us Learn more about Stack Overflow the company Business Learn more about hiring developers or posting ads with us Stack Overflow Questions Jobs Documentation Tags Users Badges Ask Question x Dismiss Join the Stack Overflow Community Stack Overflow is a community of million programmers just like you helping each other Join them it only takes a minute Sign up ldquo hellip redeclared as

gcc error messages garbled

Gcc Error Messages Garbled p here for a quick overview of the site Help Center Detailed answers to any questions you might have Meta Discuss the workings and policies of this site About Us Learn more about Stack Overflow the company Business Learn more about hiring developers or posting ads with us Stack Overflow Questions Jobs Documentation Tags Users Badges Ask Question x Dismiss Join the Stack Overflow Community Stack Overflow is a community of million programmers just like you helping each other Join them it only takes a minute Sign up gcc error-messages crippled code-page or encoding-problem up vote

gcc error list

Gcc Error List p strstr returns NULL or pointers I was only interested in the fact that a string had been found gcc error message format not where it was floppyto c parse error at end of input floppyto c gcc error messages is the program name is the line number but it is one greater then the file gcc error length This is because of unbalanced or unbalanced comments parse error before printf' Missing before this statement Segmentation error You have attempted to access gcc warnings protected storage or overwritten something important subscripted value is neither array nor pointer

gcc error output

Gcc Error Output p to stderr the standard error file and have the following form e adb Incorrect spelling of keyword function e adb should be is The first integer after the file name is the line number in the file and the second integer colorgcc is the column number within the line GPS can parse the error messages and a simple program instruction consists of operation code and operands point to the referenced character The following switches provide control over the error message format -gnatv The v stands for verbose p Gcc Output File p The effect of this

gcc error too few template-parameter-lists

Gcc Error Too Few Template-parameter-lists p here for a quick overview of the site Help Center Detailed answers to any questions you might have Meta Discuss the workings and policies of this site About Us Learn more about Stack Overflow the company Business Learn more about hiring developers or posting ads with us Stack Overflow Questions Jobs Documentation Tags Users Badges Ask Question x Dismiss Join the Stack Overflow Community Stack Overflow is a community of million programmers just like you helping each other Join them it only takes a minute Sign up ldquo too few template-parameter-lists rdquo error up

gcc error unterminated #ifndef

Gcc Error Unterminated ifndef p out Could someone take a look and show me what I'm missing I getting this compiler error unterminated ifndef But I have ifndef at the p Unterminated Ifndef Arduino p beginning and endif at the end of the class Header file Class is not followed by a macro parameter definition for teh stack ADT ifndef mystack H include ostream include fstream include stdio h include stdlib h include time h define p Unterminated Conditional Directive p mystack H const unsigned int maxSize class Stack public Stack constructor Stack Destructor bool isEmptyStack bool isFullStack void pushStack

gcc error invalid lvalue in assignment

Gcc Error Invalid Lvalue In Assignment p here for a quick overview of the site Help Center Detailed answers to any questions you might have Meta Discuss the workings and policies of this site About Us Learn more about Stack Overflow the company Business Learn more about hiring developers or posting ads with us Stack Overflow Questions Jobs Documentation Tags Users Badges Ask Question x Dismiss Join the Stack Overflow Community Stack Overflow is a community of million programmers just like you helping each other Join them it only takes a minute Sign up Invalid lvalue in Assignment error in

gcc error stdio.h

Gcc Error Stdio h p here for a quick overview of the site Help Center Detailed answers to any questions you might have Meta Discuss the workings and policies of this site About Us Learn more about Stack Overflow the company Business Learn more about hiring developers or posting ads with us Stack Overflow Questions Jobs Documentation Tags Users Badges Ask Question x Dismiss Join the Stack Overflow Community Stack Overflow is a community of million programmers just like you helping each other Join them it only takes a minute Sign up GCC fatal error stdio h No such file

gcc error 258

Gcc Error p CommunitiesAVR FreaksAtmel SMART ARM-based MCUsInternet of ThingsCapacitive TouchProjectsVendorsWiki You are hereHome Communities AVR Freaks Forums Tools Compilers and General Programming Error with Eclipse Main menu mobile Home Communities Forums Projects Vendors Wiki Search My summary Privacy Contact Site Use Terms Cookies Communities Forums Projects Vendors WIKI Error with Eclipse Log in or register to post comments Go To Last Post posts new Author Message Asinus Level New Member Joined Wed Oct Posts View posts Posted by Asinus Wed Oct - PM Fivestar widget Total votes Hi I'm realy new in using C to program microprozessors and on

gcc error code

Gcc Error Code p your program GCC reports errors with the source file p Gcc Error Message Format p name and line number where the problem is ld fatal symbol referencing errors no output written to apparent Warnings report other unusual conditions in your code that may indicate a p Gcc Errors List p problem although compilation can and does proceed Warning messages also report the source file name and line number but include the text gcc warnings lsquo warning rsquo to distinguish them from error messages Warnings may indicate danger points where you should check to make sure that

gcc error messages

Gcc Error Messages p your program GCC reports errors with the source file gcc error message format name and line number where the problem is gcc errors list apparent Warnings report other unusual conditions in your code that may indicate a p Symbol Referencing Errors C p problem although compilation can and does proceed Warning messages also report the source file name and line number but include the text p Gcc error p lsquo warning rsquo to distinguish them from error messages Warnings may indicate danger points where you should check to make sure that your program really does what

gcc error 53

Gcc Error p Link error From San Saeteurn ssaeteurn at gmail dot com To gcc-help at gcc dot gnu dot org Date Wed Apr - Subject Link error Hello Using GCC cross comiling on Windows to Linux I am getting a link error collect ld returned exit status What does this error code mean I looked all over google and the only error codes I managed to find was and Nothing on Is there a place I can go to to view a listing of all the error codes and their meaning Thank you -San Saeteurn San Saeteurn Software Engineer

gcc error cannot bind packed field

Gcc Error Cannot Bind Packed Field p cannot bind packed field error From Christoph Bartoschek gcc at pontohonk dot de To gcc-help at gcc dot gnu dot org Date Tue May Subject cannot bind packed field error Hi compiling the following code with GCC I get an error struct A union int c b attribute packed void func int const void func int int main A a func a b c Here is the error test C error cannot bind packed field 'a A b A anonymous union c' to'int ' GCC GCC and Intel's compiler compile this code without

gcc error warning preprocessor

Gcc Error Warning Preprocessor p here for a quick overview of the site Help Center Detailed answers to any questions you might have Meta Discuss the workings and policies of this site About Us Learn more about Stack Overflow the company Business Learn more about hiring developers or posting ads with us Stack Overflow Questions Jobs Documentation Tags Users Badges Ask Question x Dismiss Join the Stack Overflow Community Stack Overflow is a community of million programmers just like you helping each other Join them it only takes a minute Sign up How do I generate an error or warning

gcc error codes

Gcc Error Codes p codes can rsquo t occur on GNU systems but they can occur using the GNU C Library on other systems Macro int EPERM Operation not permitted only the owner of the file linux errno codes or other resource or processes with special privileges can perform the operation Macro linux errno example int ENOENT No such file or directory This is a ldquo file doesn rsquo t exist rdquo error for ordinary files that are referenced in gcc error message format contexts where they are expected to already exist Macro int ESRCH No process matches the specified

gcc error constructor is private

Gcc Error Constructor Is Private p here for a quick overview of the site Help Center Detailed answers to any questions you might have Meta Discuss the workings and policies of this site About Us Learn more about Stack Overflow the company Business Learn more about hiring developers or posting ads with us Stack Overflow Questions Jobs Documentation Tags Users Badges Ask Question x Dismiss Join the Stack Overflow Community Stack Overflow is a community of million programmers just like you helping each other Join them it only takes a minute Sign up Error when have private copy ctor with

gcc error message

Gcc Error Message p and How-to Solve The Problem Compilation Errors Error discards qualifiers Error storage size of foo' isn't known Error multiple types in one p Gcc Error Message Format p declaration Error invalid use of undefined type struct Foo Error no gcc warnings matching function for call to FooClass foo ' Error undefined reference to FooClass foo ' Error invalid operands of types p Gcc Pragma Warning p const char ' and const char ' to binary operator ' Error QValueList' undeclared first use this function Error cannot call member function Foo Foo instance const' without object Errors

gcc error output format

Gcc Error Output Format p here for a quick overview of the site Help Center Detailed answers to any questions you might have Meta Discuss the workings and policies of this colorgcc site About Us Learn more about Stack Overflow the company Business Learn more p Fdiagnostics-color p about hiring developers or posting ads with us Stack Overflow Questions Jobs Documentation Tags Users Badges Ask Question x gcc options Dismiss Join the Stack Overflow Community Stack Overflow is a community of million programmers just like you helping each other Join them it only takes a minute Sign up Is there

gcc error object missing in reference to

Gcc Error Object Missing In Reference To p here for a quick overview of the site Help Center Detailed answers to any questions you might have Meta Discuss the workings and policies of this site About Us Learn more about Stack Overflow the company Business Learn more about hiring developers or posting ads with us Stack Overflow Questions Jobs Documentation Tags Users Badges Ask Question x Dismiss Join the Stack Overflow Community Stack Overflow is a community of million programmers just like you helping each other Join them it only takes a minute Sign up C ldquo error rdquo object

gcc error variable-size type declared outside of any function

Gcc Error Variable-size Type Declared Outside Of Any Function p variable size type declared outside any function while declaring the function in C For example include stdio h include conio h int m n void mul int m int n int array m n int array n m int array m m UpdateCancelPromoted by Metavision comStay on top of the latest augmented reality AR happeningsPok mon GO barely touched on AR's potential Read these AR -related sites to keep up with the industryLearn More at Metavision comAnswer Wiki Answers Jaskaran Virdi Graduate Student in Computer Science at University of Calfornia

gcc error messages utf-8

Gcc Error Messages Utf- p here for a quick overview of the site Help Center Detailed answers to any questions you might have Meta Discuss the workings and policies of this site About Us Learn more about Stack Overflow the company Business Learn more about hiring developers or posting ads with us Stack Overflow Questions Jobs Documentation Tags Users Badges Ask Question x Dismiss Join the Stack Overflow Community Stack Overflow is a community of million programmers just like you helping each other Join them it only takes a minute Sign up Why does gcc have ldquo rdquo in all

gcc error unrecognized option - export-dynamic

Gcc Error Unrecognized Option - Export-dynamic p here for a quick overview of the site Help Center Detailed answers to any questions you might have Meta Discuss the workings and policies of this site About rdynamic Us Learn more about Stack Overflow the company Business Learn more about hiring xlinker developers or posting ads with us Stack Overflow Questions Jobs Documentation Tags Users Badges Ask Question x Dismiss Join the Stack Overflow Community Stack Overflow is a community of million programmers just like you helping each other Join them it only takes a minute Sign up GCC compiler error unrecognized

gcc error code list

Gcc Error Code List p here for a quick overview of the site Help Center Detailed answers to any questions you might have Meta Discuss the workings p Gcc Error Message Format p and policies of this site About Us Learn more about Stack gcc errors list Overflow the company Business Learn more about hiring developers or posting ads with us Stack Overflow Questions Jobs gcc error messages Documentation Tags Users Badges Ask Question x Dismiss Join the Stack Overflow Community Stack Overflow is a community of million programmers just like you helping each other Join them p Gcc error

gcc error /usr/lib/libcrypto.a no such file or directory

Gcc Error usr lib libcrypto a No Such File Or Directory p here for a quick overview of the site Help Center Detailed answers to any questions p Libcrypto Ubuntu p you might have Meta Discuss the workings and policies of this libcrypto source site About Us Learn more about Stack Overflow the company Business Learn more about hiring developers p Lcrypto Ubuntu p or posting ads with us Stack Overflow Questions Jobs Documentation Tags Users Badges Ask Question x Dismiss Join the Stack Overflow Community Stack Overflow is a libcrypto ios community of million programmers just like you helping

gcc error message list

Gcc Error Message List p and How-to Solve The Problem Compilation Errors Error discards qualifiers Error storage size of foo' isn't known Error multiple types in one declaration Error invalid use of undefined type struct Foo Error no matching function gcc error message format for call to FooClass foo ' Error undefined reference to FooClass foo ' Error invalid operands of gcc error messages types const char ' and const char ' to binary operator ' Error QValueList' undeclared first use this function Error cannot call member gcc error function Foo Foo instance const' without object Errors non-pointer type non-aggregate

gcc error xitwas not declared in this scope

Gcc Error Xitwas Not Declared In This Scope p here for a quick overview of the site Help Center Detailed answers to any questions you might have Meta Discuss the workings and policies of this site About Us Learn more about Stack Overflow the company Business Learn more about hiring developers or posting ads with us Stack Overflow Questions Jobs Documentation Tags Users Badges Ask Question x Dismiss Join the Stack Overflow Community Stack Overflow is a community of million programmers just like you helping each other Join them it only takes a minute Sign up 'inet ntoa' not declared

gcc error message full path

Gcc Error Message Full Path p Full path in compiler warning error messages From Geert Vancompernolle geert dot vancompernolle at gmail dot com To gcc-help at gcc dot gnu dot org Date Tue Mar Subject Full path in compiler warning error messages Hi I have a situation where I can only see part of the path name when gcc g finds errors warnings One such example is given below src mqmgr cpp In member function virtual void CMqMgrUnique Execute ' src mqmgr cpp warning unsigned int format pointer arg arg src mqmgr cpp warning int format long int arg arg

gcc error unsupported relocation against

Gcc Error Unsupported Relocation Against p here for a quick overview of the site Help Center Detailed answers to any questions you might have Meta Discuss the workings and policies of this site About Us Learn more about Stack Overflow the company Business Learn more about hiring developers or posting ads with us Stack Overflow Questions Jobs Documentation Tags Users Badges Ask Question x Dismiss Join the Stack Overflow Community Stack Overflow is a community of million programmers just like you helping each other Join them it only takes a minute Sign up ldquo Error unsupported relocation against register rdquo

gcc error trying to exec as

Gcc Error Trying To Exec As p title You can not post a blank message Please type your message and try again Up to p Gcc Error Trying To Exec cc plus Execvp No Such File Or Directory Fedora p Discussions inNI Linux Real-Time Views Replies Latest reply Oct gcc error trying to exec cc AM by Luukgr Calculating status Luukgr Currently Being Moderated Oct gcc error trying to exec f execvp no such file or directory AM gcc error trying to exec 'as' execvp No such file or directory Hi I'm pretty new to the myRIO and I'm trying

gcc error non-template used as template

Gcc Error Non-template Used As Template p here for a quick overview of the site Help Center Detailed answers to any questions you might have Meta Discuss the workings and policies of this site About Us Learn more about Stack Overflow the company Business Learn more about hiring developers or posting ads with us Stack Overflow Questions Jobs Documentation Tags Users Badges Ask Question x Dismiss Join the Stack Overflow Community Stack Overflow is a community of million programmers just like you helping each other Join them it only takes a minute Sign up Which compiler is right 'template' before

gcc error message encoding

Gcc Error Message Encoding p here for a quick overview of the site Help Center Detailed answers to any questions you might have Meta Discuss the workings and policies of this site About Us Learn more about Stack Overflow the company Business Learn more about hiring developers or posting ads with us Stack Overflow Questions Jobs Documentation Tags Users Badges Ask Question x Dismiss Join the Stack Overflow Community Stack Overflow is a community of million programmers just like you helping each other Join them it only takes a minute Sign up gcc error-messages crippled code-page or encoding-problem up vote